Search found 2 matches

by Muaid
2010-10-10, 12:41
Forum: Coding and Scripting
Topic: error when compile under Ubuntu 10.10
Replies: 3
Views: 1737

Re: error when compile under Ubuntu 10.10

i solve the problem :D but it is good to write the solution here (may help some ppl like me :cheesy: ) i found the lib (libgdk_pixbuf-2.0.so) in the /usr/lib folder so i just make a simple link and its works perfectly sudo ln -s /usr/lib/libgdk_pixbuf-2.0.so /usr/lib/libgdk_pixbuf-2.012.so thanks al...
by Muaid
2010-10-10, 12:26
Forum: Coding and Scripting
Topic: error when compile under Ubuntu 10.10
Replies: 3
Views: 1737

error when compile under Ubuntu 10.10

hi all .. i am new in Cafu Engine and i really like to try it .. i got error when i compiling the code (my command is : scons -j 2) and the error : /usr/bin/ld: cannot find -lgdk_pixbuf-2.012 collect2: ld returned 1 exit status scons: *** [build/linux2/g++/release/Ca3DE/Cafu] Error 1 scons: building...