Hello, quick question

Get help with installing and running the Cafu Engine here. This forum is also for general questions and discussion of all aspects regarding the Cafu Engine.
Post Reply
luke
Posts: 2
Joined: 2010-06-29, 01:06

Hello, quick question

Post by luke » 2010-06-29, 01:39

Wonderful looking place you've got here. I've just downloaded your source with subversion and I'm trying to compile.

My info:

Code: Select all

Linux fliglick 2.6.32-22-generic #36-Ubuntu SMP Thu Jun 3 19:31:57 UTC 2010 x86_64 GNU/Linux

Code: Select all

scons --version
SCons by Steven Knight et al.:
        script: v1.2.0.d20100117.r4629, 2010/01/17 22:23:21, by scons on scons-dev
        engine: v1.2.0.d20100117.r4629, 2010/01/17 22:23:21, by scons on scons-dev
Copyright (c) 2001, 2002, 2003, 2004, 2005, 2006, 2007, 2008, 2009, 2010 The SCons Foundation

Code: Select all

g++ --version
g++ (Ubuntu 4.4.3-4ubuntu5) 4.4.3
Copyright (C) 2009 Free Software Foundation, Inc.
This is free software; see the source for copying conditions.  There is NO
warranty; not even for MERCHANTABILITY or FITNESS FOR A PARTICULAR PURPOSE.

Code: Select all

prerequisite package versions:
build-essential 11.4build1
libasound2-dev 1.0.22-0ubuntu7
libglu1-mesa-dev 7.7.1-1ubuntu3
libgtk2.0-dev 2.20.1-0ubuntu2

Code: Select all

DISTRIB_ID=Ubuntu
DISTRIB_RELEASE=10.04
DISTRIB_CODENAME=lucid
DISTRIB_DESCRIPTION="Ubuntu 10.04 LTS"
-------------------------------------------------------------------------------

Error message:

Code: Select all

g++ -o Libs/build/linux2/g++/debug/SoundSystem/Common/MP3Stream.os -c -g -funsigned-char -Wall -Werror -Wno-char-subscripts -fPIC -DDEBUG -DSCONS_BUILD_DIR=build/linux2/g++/debug -ILibs -IExtLibs -IExtLibs/freealut/include -IExtLibs/mpg123/src/libmpg123 -IExtLibs/libvorbis/include -IExtLibs/libogg/include -IExtLibs/openal-soft/include Libs/SoundSystem/Common/MP3Stream.cpp
Libs/SoundSystem/Common/MP3Stream.cpp: In constructor 'MPG123InstanceT::MPG123InstanceT()':
Libs/SoundSystem/Common/MP3Stream.cpp:84: error: 'runtime_error' is not a member of 'std'
Libs/SoundSystem/Common/MP3Stream.cpp: In constructor 'MP3StreamT::MP3StreamT(const std::string&)':
Libs/SoundSystem/Common/MP3Stream.cpp:117: error: 'runtime_error' is not a member of 'std'
Libs/SoundSystem/Common/MP3Stream.cpp:125: error: 'runtime_error' is not a member of 'std'
Libs/SoundSystem/Common/MP3Stream.cpp:134: error: 'runtime_error' is not a member of 'std'
Libs/SoundSystem/Common/MP3Stream.cpp:141: error: 'runtime_error' is not a member of 'std'
Libs/SoundSystem/Common/MP3Stream.cpp:151: error: 'runtime_error' is not a member of 'std'
scons: *** [Libs/build/linux2/g++/debug/SoundSystem/Common/MP3Stream.os] Error 1
scons: building terminated because of errors.
Any suggestions?
User avatar
Carsten
Site Admin
Posts: 2169
Joined: 2004-08-19, 13:46
Location: Germany
Contact:

Re: Hello, quick question

Post by Carsten » 2010-06-29, 16:37

Hi Luke,
welcome to the Cafu forums, :welcome:
and thanks for your great and detailed report!

The issue is fixed now in svn head, please run svn update and try again. :up:
Best regards,
Carsten
luke
Posts: 2
Joined: 2010-06-29, 01:06

Re: Hello, quick question

Post by luke » 2010-06-30, 06:36

Awesome, that took care of it. :)
User avatar
Hidong
Posts: 22
Joined: 2008-04-19, 21:09
Location: Germany, Bremen
Contact:

Re: Hello, quick question

Post by Hidong » 2010-07-18, 19:53

Hi, where can i find the "svn update"?
User avatar
Carsten
Site Admin
Posts: 2169
Joined: 2004-08-19, 13:46
Location: Germany
Contact:

Re: Hello, quick question

Post by Carsten » 2010-07-18, 21:07

Hidong wrote:Hi, where can i find the "svn update"?
http://subversion.apache.org/
Best regards,
Carsten
Post Reply

Who is online

Users browsing this forum: No registered users and 3 guests